Jump to content

Search the Community

Showing results for tags ' error'.



More search options

  • Search By Tags

    Type tags separated by commas.
  • Search By Author

Content Type


Categories

  • Mangos Zero
    • Enhancement Requests (Zero)
    • Tasks (Zero)
  • Mangos One
    • Enhancement Requests (One)
    • Tasks (One)
  • Mangos Two
    • Enhancement Requests (Two)
    • Tasks (Two)
  • Mangos Three
    • Enhancement Requests (Three}
    • Tasks (Three)
  • Mangos Four
    • Enhancement Requests (Four)
    • Tasks (Four)
  • Mangos Five
    • Enhancement Requests (Five)
    • Tasks (Five)
  • Cross-Core
    • Bugs
    • Enhancement Requests
    • Tasks
    • Sub-Modules
    • Eluna
    • Linux
    • Windows
    • Archived Cross-Core/Other Reports
  • Others
    • Mangos VB
    • Third Party Software
    • Website
  • Bug Tracker Archives (Resolved issues)
    • Archived Reports (Zero)(Resolved issues)
    • Archived Tasks (Zero)(Resolved issues)
    • Archived Reports (One)(Resolved issues)
    • Archived Tasks (One)(Resolved issues)
    • Archived Reports (Two)(Resolved issues)
    • Archived Tasks (Two)(Resolved issues)
    • Archived Reports (Three)(Resolved issues)
    • Archived Reports (Five)(Resolved issues)

Categories

  • Development Roadmap
  • Documentation
    • Installation Guides
    • Playerbot AI
    • Standards And Practices
  • Tutorials
    • Advanced
    • Contributing to Mangos
    • Debugging
  • Reference Information
    • ClientFiles
    • Database Info
    • DBC Files
    • Other
    • Packet Info
    • Server Files
    • Server Components

Forums

  • MaNGOS Information
    • Announcements & Releases
    • Covenant-WoW.com Website - Official Mangos Test Servers
  • Community Discussion Areas
    • Introduce Yourself
    • Community Cafe
    • Community Input
    • Community Projects
    • MaNGOS University
  • Community Help and Support
    • Peer to Peer Technical Support
    • Frequently Asked Questions
    • Resources
  • Development & Patch Submissions
    • Development
    • Patch Submissions
  • Eluna LUA Engine
    • Eluna Central
  • International Help & Support
    • International Boards
  • Archived
    • Main Archives
    • Archive of Pre-2012 Forum

Product Groups

There are no results to display.

Categories

  • Mangos Zero
  • Mangos One
  • Mangos Two
  • Mangos Three
  • Addons
    • Classic Addons
  • World Of Warcraft Patches
    • WoW Patches
    • The Burning Crusade Patches
    • Wrath of the Lich King
    • Client Tools Patchers

Blogs

  • getMaNGOS
  • DBC handling for mangos
  • The Road to Zero Release 21
  • Necrovoice's development blog.
  • What the Heck happened to Antz and MaNGOS in 2018 !!

Find results in...

Find results that contain...


Date Created

  • Start

    End


Last Updated

  • Start

    End


Filter by number of...

Joined

  • Start

    End


Group


Core


Skype


Discord


Website URL


AIM


ICQ


Yahoo


Jabber


About Me


Gender


Location


Interests

Found 43 results

  1. Thought I would attempt to set up a rel21 mangoszero server. Is there a way to compile through visual studio like the previous builds? Or do we have to use this EasyBuild thing? Because I installed OpenSSL 32 +64, I installed CMake, but when I go to generate project I get: CMake Error at CMakeLists.txt:20 (project): No CMAKE_C_COMPILER could be found. CMake Error at CMakeLists.txt:20 (project): No CMAKE_CXX_COMPILER could be found. Not sure if i am supposed to be doing something with CMake, but I have no idea what this program is and have never used it before - I just installed it and assumed that was enough. Thanks, -J
  2. Hi there, I'm new here so let me say at first that i really appreciate your work what you are doing in developing the core. Thanks a lot for that ! My problem is that after i compiled the develop21 release of Mangos One i installed the develop21 release of the database, but I get the following error after starting mangosd.exe: 2016-06-25 13:41:26 ERROR:The table `db_version` indicates that your [Character] database does not match the expected structure! 2016-06-25 13:41:26 ERROR: 2016-06-25 13:41:26 ERROR: [A] You have database Version: 21 2016-06-25 13:41:26 ERROR: Structure: 1 2016-06-25 13:41:26 ERROR: Content: 0 2016-06-25 13:41:26 ERROR: Description: revision_refactor 2016-06-25 13:41:26 ERROR: 2016-06-25 13:41:26 ERROR: You need database Version: 21 2016-06-25 13:41:26 ERROR: Structure: 2 2016-06-25 13:41:26 ERROR: Content: 1 2016-06-25 13:41:26 ERROR: Description: match_client_limits 2016-06-25 13:41:26 ERROR: 2016-06-25 13:41:26 ERROR:You must apply all updates after [A] to to use MaNGOS with this database. 2016-06-25 13:41:26 ERROR:These updates are included in the database/Character/Updates folder. When i install these updates i mess everything up. Which updates do i exactly need to apply to match the exact Structure "2" and Content "1"? Thanks a bunch! JayDee Edit: I used only the character updates and now it seemed to work. Can I ignore this error? 2016-06-25 13:50:01 ERROR:You have not updated the core for few DB [World] updates! 2016-06-25 13:50:01 ERROR:Current DB content is 50, core expects 8 2016-06-25 13:50:01 ERROR:This is ok for now but should not last long. I compiled the latest core ?!?
  3. After successfully cloning Develop21 from the Github repo and setting a working environment for Visual Studio 2012 under Windows7 SP1 I couldn't compile the sources from scratch with the default options... The error I get is something related to Bindingmap.h: 1>------ Build started: Project: LuaEngine, Configuration: Release Win32 ------ 1> BattleGroundHooks.cpp 1> CreatureHooks.cpp 1> GameObjectHooks.cpp 1> GossipHooks.cpp 1>e:\games\wow\server\prereqs\source\server\src\modules\eluna\BindingMap.h(269): error C2143: syntax error : missing ',' before '...' (E:\Games\WoW\Server\PreReqs\source\server\src\modules\Eluna\GossipHooks.cpp) 1>e:\games\wow\server\prereqs\source\server\src\modules\eluna\BindingMap.h(270): error C2065: 'T' : undeclared identifier (E:\Games\WoW\Server\PreReqs\source\server\src\modules\Eluna\GossipHooks.cpp) 1>e:\games\wow\server\prereqs\source\server\src\modules\eluna\BindingMap.h(270): error C2143: syntax error : missing ')' before 'const' (E:\Games\WoW\Server\PreReqs\source\server\src\modules\Eluna\GossipHooks.cpp) 1>e:\games\wow\server\prereqs\source\server\src\modules\eluna\BindingMap.h(270): error C2433: 'hash' : 'inline' not permitted on data declarations (E:\Games\WoW\Server\PreReqs\source\server\src\modules\Eluna\GossipHooks.cpp) 1>e:\games\wow\server\prereqs\source\server\src\modules\eluna\BindingMap.h(270): error C2059: syntax error : ')' (E:\Games\WoW\Server\PreReqs\source\server\src\modules\Eluna\GossipHooks.cpp) 1>e:\games\wow\server\prereqs\source\server\src\modules\eluna\BindingMap.h(277): error C2065: 'T' : undeclared identifier (E:\Games\WoW\Server\PreReqs\source\server\src\modules\Eluna\GossipHooks.cpp) 1>e:\games\wow\server\prereqs\source\server\src\modules\eluna\BindingMap.h(277): error C2923: 'std::is_enum' : 'T' is not a valid template type argument for parameter '_Ty' (E:\Games\WoW\Server\PreReqs\source\server\src\modules\Eluna\GossipHooks.cpp) 1>e:\games\wow\server\prereqs\source\server\src\modules\eluna\BindingMap.h(277): error C2039: 'type' : is not a member of 'std::enable_if<_Test,_Ty>' 1> with 1> [ 1> _Test=false, 1> _Ty=void 1> ] (E:\Games\WoW\Server\PreReqs\source\server\src\modules\Eluna\GossipHooks.cpp) 1>e:\games\wow\server\prereqs\source\server\src\modules\eluna\BindingMap.h(279): error C2334: unexpected token(s) preceding '{'; skipping apparent function body (E:\Games\WoW\Server\PreReqs\source\server\src\modules\Eluna\GossipHooks.cpp) 1>e:\games\wow\server\prereqs\source\server\src\modules\eluna\BindingMap.h(287): error C4519: default template arguments are only allowed on a class template (E:\Games\WoW\Server\PreReqs\source\server\src\modules\Eluna\GossipHooks.cpp) 1>e:\games\wow\server\prereqs\source\server\src\modules\eluna\BindingMap.h(297): error C2143: syntax error : missing ',' before '...' (E:\Games\WoW\Server\PreReqs\source\server\src\modules\Eluna\GossipHooks.cpp) 1>e:\games\wow\server\prereqs\source\server\src\modules\eluna\BindingMap.h(298): error C2061: syntax error : identifier 'T' (E:\Games\WoW\Server\PreReqs\source\server\src\modules\Eluna\GossipHooks.cpp) 1>e:\games\wow\server\prereqs\source\server\src\modules\eluna\BindingMap.h(269): error C2143: syntax error : missing ',' before '...' (E:\Games\WoW\Server\PreReqs\source\server\src\modules\Eluna\CreatureHooks.cpp) 1>e:\games\wow\server\prereqs\source\server\src\modules\eluna\BindingMap.h(270): error C2065: 'T' : undeclared identifier (E:\Games\WoW\Server\PreReqs\source\server\src\modules\Eluna\CreatureHooks.cpp) 1>e:\games\wow\server\prereqs\source\server\src\modules\eluna\BindingMap.h(270): error C2143: syntax error : missing ')' before 'const' (E:\Games\WoW\Server\PreReqs\source\server\src\modules\Eluna\CreatureHooks.cpp) 1>e:\games\wow\server\prereqs\source\server\src\modules\eluna\BindingMap.h(270): error C2433: 'hash' : 'inline' not permitted on data declarations (E:\Games\WoW\Server\PreReqs\source\server\src\modules\Eluna\CreatureHooks.cpp) 1>e:\games\wow\server\prereqs\source\server\src\modules\eluna\BindingMap.h(270): error C2059: syntax error : ')' (E:\Games\WoW\Server\PreReqs\source\server\src\modules\Eluna\CreatureHooks.cpp) 1>e:\games\wow\server\prereqs\source\server\src\modules\eluna\BindingMap.h(277): error C2065: 'T' : undeclared identifier (E:\Games\WoW\Server\PreReqs\source\server\src\modules\Eluna\CreatureHooks.cpp) 1>e:\games\wow\server\prereqs\source\server\src\modules\eluna\BindingMap.h(277): error C2923: 'std::is_enum' : 'T' is not a valid template type argument for parameter '_Ty' (E:\Games\WoW\Server\PreReqs\source\server\src\modules\Eluna\CreatureHooks.cpp) 2>------ Build started: Project: mangosd, Configuration: Release Win32 ------ 2>LINK : fatal error LNK1181: cannot open input file '..\modules\Eluna\Release\LuaEngine.lib' 3>------ Skipped Build: Project: INSTALL, Configuration: Release Win32 ------ 3>Project not selected to build for this solution configuration ========== Build: 0 succeeded, 2 failed, 21 up-to-date, 1 skipped ========== The sources compile fine if I don't include ELUNA on the options... UPDATE: I managed to compile the source on Visual Studio 2013 as Eluna complained about not being compatible with older VS, the source compiled fine with some warnings on the Bindingmap.h from Eluna but completed successfully without errors... Then I started the server only to get a World Server crash at the startup, btw this only happens if I set to load Eluna = 1, thanks in advance for any help...
  4. First time setting up mangos, followed a few of the guides posted on forums and tried searching the issue. it looks like the database isn't populating correctly. I tried running make_full_WorldDB.sh and InstallDatabases.bat but still didn't work. Any suggestions? Nevermind, the realm folder didn't copy over in the zip. Now I'm having issues getting other people to connect to the server :>
  5. Hey guys, yesterday I've started to setup my mangos-server - but it didnt went that well. I've run into an issue where my compiler wont compile the latest source. I am using the following command: cmake ../ -DSOAP=1 -DSCRIPT_LIB_ELUNA=1 -DSCRIPT_LIB_SD2=1 -DBUILDTOOLS=0 -DCMAKE_INSTALL_PREFIX=/root/wow-build/mangos-zero make -j 4 Errors: collect2: error: ld returned 1 exit status src/tools/Movemap-Generator/CMakeFiles/movemap-generator.dir/build.make:193: recipe for target 'src/tools/Movemap-Generator/movemap-generator' failed make[2]: *** [src/tools/Movemap-Generator/movemap-generator] Error 1 CMakeFiles/Makefile2:1332: recipe for target 'src/tools/Movemap-Generator/CMakeFiles/movemap-generator.dir/all' failed make[1]: *** [src/tools/Movemap-Generator/CMakeFiles/movemap-generator.dir/all] Error 2 [ 81%] Built target mangosscript Makefile:117: recipe for target 'all' failed make: *** [all] Error 2 Installed compilers: ii g++ 4:4.9.2-2 amd64 GNU C++ compiler ii g++-4.9 4.9.2-10 amd64 GNU C++ compiler ii gcc 4:4.9.2-2 amd64 GNU C compiler ii gcc-4.9 4.9.2-10 amd64 GNU C compiler Greetings Kevin
  6. Hi, I recently followed a guide on how to install Mangos and it all went well untill now. Apparently my database is out of date and I have no clue how to fix that. I applied the updates in rel21 and in Rel20_to_BaseRel21_Updates. I got the core and the database from the following guide This is the error I am getting after applying the above updates: 2016-05-03 15:27:21 21000 [world-daemon] 2016-05-03 15:27:21 <Ctrl-C> to stop. __ __ _ _ ___ ___ ___ | \/ |__ _| \| |/ __|/ _ \/ __| We Love | |\/| / _` | .` | (_ | (_) \__ \ Vanilla Wow |_| |_\__,_|_|\_|\___|\___/|___/ ____ For help and support please visit: /_ /___ _ _ ___ Website: getMaNGOS | The home of MaNGOS - Home / // -_) '_/ _ \ Forum / Wiki: getMaNGOS | The home of MaNGOS - Home /___\___|_| \___/ 2016-05-03 15:27:21 Using configuration file mangosd.conf. 2016-05-03 15:27:21 World Database total connections: 2 2016-05-03 15:27:21 MySQL client library: 5.6.25 2016-05-03 15:27:21 MySQL server ver: 5.6.25-log 2016-05-03 15:27:21 MySQL client library: 5.6.25 2016-05-03 15:27:21 MySQL server ver: 5.6.25-log 2016-05-03 15:27:21 ERROR:The table `db_version` indicates that your [World] database does not match the expected structure! 2016-05-03 15:27:21 ERROR: 2016-05-03 15:27:21 ERROR: [A] You have database Version: 21 2016-05-03 15:27:21 ERROR: Structure: 1 2016-05-03 15:27:21 ERROR: Content: 19 2016-05-03 15:27:21 ERROR: Description: SD3_Updates 2016-05-03 15:27:21 ERROR: 2016-05-03 15:27:21 ERROR: You need database Version: 21 2016-05-03 15:27:21 ERROR: Structure: 11 2016-05-03 15:27:21 ERROR: Content: 7 2016-05-03 15:27:21 ERROR: Description: Fix BG buffs 2016-05-03 15:27:21 ERROR: 2016-05-03 15:27:21 ERROR:You must apply all updates after [A] to to use MaNGOS with this database. 2016-05-03 15:27:21 ERROR:These updates are included in the database/World/Updates folder. Thanks in advance
  7. When I try to update the data bases to resolve 2016-04-20 19:00:36 ERROR:The table `db_version` indicates that your [Realmd] database does not match the expected version! 2016-04-20 19:00:36 ERROR: 2016-04-20 19:00:36 ERROR: [A] You have database Version: 21 2016-04-20 19:00:36 ERROR: Structure: 1 2016-04-20 19:00:36 ERROR: Content: 2 2016-04-20 19:00:36 ERROR: Description: dbdocs update 2016-04-20 19:00:36 ERROR: 2016-04-20 19:00:36 ERROR: [b] You need database Version: 21 2016-04-20 19:00:36 ERROR: Structure: 1 2016-04-20 19:00:36 ERROR: Content: 0 2016-04-20 19:00:36 ERROR: Description: revision_refactor 2016-04-20 19:00:36 ERROR: 2016-04-20 19:00:36 ERROR:You are missing content updates or you have content updates beyond the expected core version. 2016-04-20 19:00:36 ERROR:It is recommended to run ALL database updates up to the required core version. 2016-04-20 19:00:36 ERROR:These updates are included in the database/Realmd/Updates folder. 2016-04-20 19:00:36 ERROR:No valid realms specified. I get ERROR 1146 (42S02) at line 4: Table 'realmdzero.realmd_db_version' doesn't exist
  8. Hi, I'm trying to start mangosd.exe after running realmd.exe and I get this error: So I decided to try and update the database through the given instruction. 20007_18_Deadmines_Mr_Smite_Corrections.sql imports fine but when I try to execute 20007_01_Rel20_Release_Prep.sql I get this mysql error: I'm running mysql 5.5.49 community edition server on Windows 10 64bit Also is there some place I can find updated documentation about the installation process?
  9. So I've learned a ton in my time here and I'm SO CLOSE to having my server up and running, I just have one issue. When I'm using SQLyog to try and update my databases it keeps throwing errors. Realmd is fine, it's Characters and the World server that are both giving me trouble. The worst part is I have all the appropriate updates SQLyog just doesn't like applying them, I could try via the command line but I don't want to break anything after coming this far. Here's the errors: Characters: Then World, when I try to go from 21_3_3 to 21_3_4, because you do need to go sequentially correct? This is the error the server log is throwing in general
  10. Game server does not start, the login server is started, the update added to the database, can not understand the reason, finding used but do not understand, I need to compile again? sorry for my English, have all night can not run server. Please help. Also I have a bottle of water, it's your mad max. 2016-04-22 07:11:14 21000 [world-daemon] 2016-04-22 07:11:14 <Ctrl-C> to stop. __ __ _ _ ___ ___ ___ | \/ |__ _| \| |/ __|/ _ \/ __| We Love | |\/| / _` | .` | (_ | (_) \__ \ Vanilla Wow |_| |_\__,_|_|\_|\___|\___/|___/ ____ For help and support please visit: /_ /___ _ _ ___ Website: getMaNGOS | The home of MaNGOS - Home / // -_) '_/ _ \ Wiki: MaNGOS Wiki * GitHub /___\___|_| \___/ 2016-04-22 07:11:14 Using configuration file mangosd.conf. 2016-04-22 07:11:14 World Database total connections: 2 2016-04-22 07:11:14 MySQL client library: 5.6.26 2016-04-22 07:11:14 MySQL server ver: 4.1.12a-nt 2016-04-22 07:11:14 MySQL client library: 5.6.26 2016-04-22 07:11:14 MySQL server ver: 4.1.12a-nt 2016-04-22 07:11:14 ERROR:SQL: SELECT version, structure, content, description FROM db_version ORDER BY version DESC, structure DESC, content DESC LIMIT 1 2016-04-22 07:11:14 ERROR:query ERROR: Unknown column 'structure' in 'field list' 2016-04-22 07:11:14 ERROR:The table `db_version` in your [World] database is missing or corrupt. 2016-04-22 07:11:14 ERROR: 2016-04-22 07:11:14 ERROR: [A] You have database Version: MaNGOS can not verify your database version or its existence! 2016-04-22 07:11:14 ERROR: 2016-04-22 07:11:14 ERROR: You need database Version: 21 2016-04-22 07:11:14 ERROR: Structure: 1 2016-04-22 07:11:14 ERROR: Content: 0 2016-04-22 07:11:14 ERROR: Description: revision_refactor 2016-04-22 07:11:14 ERROR: 2016-04-22 07:11:14 ERROR:Please verify your database location or your database integrity.
  11. When following the Wiki CentOS 7 en guide, I'm running into an error when executing cmake command: mkdir _build && cd _build and here is the huge command of the day: ***I'm making an assumption here that the above should be, because the above when followed as posted leads to an error about missing CMakeLists.txt mkdir /opt/mangos/SOURCES/server/src/bindings/scripts/_build && cd /opt/mangos/SOURCES/server/src/bindings/scripts/_build When running the following, you get the error listed below. cmake .. -DTBB_USE_EXTERNAL=1 -DCMAKE_BUILD_TYPE=release -DACE_USE_EXTERNAL=0 -DCMAKE_INSTALL_PREFIX=/opt/mangos -DINCLUDE_BINDINGS_DIR=scripts -DPCH=0 -DCMAKE_CXX_FLAGS="-O3 -march=native" -DCMAKE_C_FLAGS="-O3 -march=native" results in the following error: CMake Error at CMakeLists.txt:95 (set_target_properties): set_target_properties called with incorrect number of arguments. CMake Error at CMakeLists.txt:138 (install): install TARGETS given no LIBRARY DESTINATION for shared library target "mangosscript". CMake Error at CMakeLists.txt:143 (install): install FILES given no DESTINATION! CMake Warning (dev) in CMakeLists.txt: No cmake_minimum_required command is present. A line of code such as cmake_minimum_required(VERSION 2.8) should be added at the top of the file. The version specified may be lower if you wish to support older CMake versions for this project. For more information run "cmake --help-policy CMP0000". This warning is for project developers. Use -Wno-dev to suppress it. -- Configuring incomplete, errors occurred! I'm trying to polish the tutorial a bit and make it easier for CentOS users. Thanks!
  12. Hello all, I'm trying to setup my own server and while I've overcome a lot of issues via trial and error I seem to have a issue with the version of my database I've complied. I'm not sure how because I just downloaded the source from Git today. Here's what I see in my server.log file. Any help would be great! Thanks
  13. CMake Error at cmake/FindMySQL.cmake:75 (message): Could not find 32-bit MySQL headers or libraries! Please install the development libraries and headers. Call Stack (most recent call first): CMakeLists.txt:116 (find_package) Any idea what the issue is? I switched between 64-bit and 32-bit mysql
  14. MangosZERO on windows64. Ive followed REL21+ TEMPORARY COMPILE GUIDE Server starts just fine and I can login without any problems but no quests appear in game. A closer look at World-server.log states that DB table `quest_relations` is empty. When connecting to the DB and looking at the tables I cant find a table called `quest_relations` just a table called 'gameobject_questrelation' is this the problem? World-server.log 2016-04-14 02:07:33 Loading Quests... 2016-04-14 02:07:34 >> Loaded 4248 quests definitions 2016-04-14 02:07:34 2016-04-14 02:07:34 Loading Quests Relations... 2016-04-14 02:07:34 ERROR:SQL: SELECT entry, quest FROM quest_relations WHERE actor = 1 AND role = 0 2016-04-14 02:07:34 ERROR:query ERROR: Table 'mangos.quest_relations' doesn't exist 2016-04-14 02:07:34 2016-04-14 02:07:34 ERROR:>> Loaded 0 quest relations. DB table `quest_relations` is empty. 2016-04-14 02:07:34 ERROR:SQL: SELECT entry, quest FROM quest_relations WHERE actor = 1 AND role = 1 2016-04-14 02:07:34 ERROR:query ERROR: Table 'mangos.quest_relations' doesn't exist 2016-04-14 02:07:34 2016-04-14 02:07:34 ERROR:>> Loaded 0 quest relations. DB table `quest_relations` is empty. 2016-04-14 02:07:34 ERROR:SQL: SELECT entry, quest FROM quest_relations WHERE actor = 0 AND role = 0 2016-04-14 02:07:34 ERROR:query ERROR: Table 'mangos.quest_relations' doesn't exist 2016-04-14 02:07:34 2016-04-14 02:07:34 ERROR:>> Loaded 0 quest relations. DB table `quest_relations` is empty. 2016-04-14 02:07:34 ERROR:SQL: SELECT entry, quest FROM quest_relations WHERE actor = 0 AND role = 1 2016-04-14 02:07:34 ERROR:query ERROR: Table 'mangos.quest_relations' doesn't exist 2016-04-14 02:07:34 2016-04-14 02:07:34 ERROR:>> Loaded 0 quest relations. DB table `quest_relations` is empty. 2016-04-14 02:07:34 >>> Quests Relations loaded Everything else seems to load just fine, when running InstallDatabases.bat it gives no errors exept that DB mangos (world) already exists. I looked through \World\Updates\Rel21 and tried to add quest related .sql files like Rel21_05_6_quest_1948.sq but get this output: Preparing... Importing Rel21_05_6_quest_1948.sql... Finished executing script ===== Status ===== === Expected === ===== Found Version ===== * UPDATE SKIPPED * NULL quest_relations Operation completed successfully I need some help here please! Not sure what to do.
  15. Hey guys, I've ran through every guide that I can find on these forums, on the github and through the stickies. I've installed completely fresh about 6 times and I always without fail get these errors. I will attach a log for the support staff perusal. The two errors that seem to be stopping me are ERROR:SQL: can not execute 'UPDATE account SET last_ip = ? WHERE username = ?' ERROR:SQL ERROR: Truncated incorrect DOUBLE value: 'ADMINISTRATOR' and secondly: ERROR:SQL: can not execute 'INSERT INTO characters (guid,account,name,race,class,gender,level,xp,money,playerBytes,playerBytes2,playerFlags,map, position_x, position_y, position_z, orientation, taximask, online, cinematic, totaltime, leveltime, rest_bonus, logout_time, is_logout_resting, resettalents_cost, resettalents_time, trans_x, trans_y, trans_z, trans_o, transguid, extra_flags, stable_slots, at_login, zone, death_expire_time, taxi_path, honor_highest_rank, honor_standing, stored_honor_rating , stored_dishonorable_kills, stored_honorable_kills, watchedFaction, drunk, health, power1, power2, power3, power4, power5, exploredZones, equipmentCache, ammoId, actionBars) VALUES ( ?, ?, ?, ?, ?, ?, ?, ?, ?, ?, ?, ?,?, ?, ?, ?, ?, ?, ?, ?, ?, ?, ?, ?, ?, ?, ?, ?, ?, ?, ?, ?, ?, ?, ?, ?, ?, ?, ?, ?, ?, ?, ?, ?, ?, ?, ?, ?, ?, ?, ?, ?, ?, ?, ?) ' 2016-04-13 14:19:48 ERROR:SQL ERROR: No data supplied for parameters in prepared statement Any help would be awesome! [ATTACH]334[/ATTACH] [ATTACH]335[/ATTACH] EDIT WITH SOLUTION If your server binary folder (The ones with mangosd.exe and your databases) doesn't contain libmysql.dll, you need to retrieve it from your mySQL installation. It's contained within the lib folder. world-server.txt realm-list.txt
  16. I am trying to compile ManGOS-One on Ubuntu 12.04 x64 Server (VPS). I have installed all the required tools but when I compile, I end up with the following errors: -- Build files have been written to: /home/tester123/server/build ------------------------- Compiling MaNGOS One... ------------------------- Scanning dependencies of target genrev Scanning dependencies of target bzip2 Scanning dependencies of target lualib Scanning dependencies of target recast Scanning dependencies of target detour [ 0%] Building CXX object CMakeFiles/genrev.dir/src/tools/genrevision/genrevision.cpp.o [ 0%] cc1plus: error: unrecognized command line option ‘-std=c++11’ make[2]: *** [CMakeFiles/genrev.dir/src/tools/genrevision/genrevision.cpp.o] Error 1 make[1]: *** [CMakeFiles/genrev.dir/all] Error 2 make[1]: *** Waiting for unfinished jobs.... [ 0%] [ 0%] Building C object dep/bzip2/CMakeFiles/bzip2.dir/huffman.c.o Building CXX object dep/recastnavigation/Recast/CMakeFiles/recast.dir/Source/RecastFilter.cpp.o Building C object dep/bzip2/CMakeFiles/bzip2.dir/compress.c.o [ 0%] Scanning dependencies of target ace Building CXX object dep/recastnavigation/Detour/Source/CMakeFiles/detour.dir/DetourAlloc.cpp.o cc1plus: error: unrecognized command line option ‘-std=c++11’ make[2]: *** [dep/recastnavigation/Recast/CMakeFiles/recast.dir/Source/RecastFilter.cpp.o] Error 1 make[1]: *** [dep/recastnavigation/Recast/CMakeFiles/recast.dir/all] Error 2 cc1plus: error: unrecognized command line option ‘-std=c++11’ make[2]: *** [dep/recastnavigation/Detour/Source/CMakeFiles/detour.dir/DetourAlloc.cpp.o] Error 1 make[1]: *** [dep/recastnavigation/Detour/Source/CMakeFiles/detour.dir/all] Error 2 [ 0%] [ 1%] Building C object dep/bzip2/CMakeFiles/bzip2.dir/blocksort.c.o Building C object dep/bzip2/CMakeFiles/bzip2.dir/decompress.c.o [ 1%] Building C object dep/lualib/CMakeFiles/lualib.dir/ldump.c.o [ 1%] [ 1%] Building C object dep/lualib/CMakeFiles/lualib.dir/lstring.c.o Building C object dep/bzip2/CMakeFiles/bzip2.dir/bzlib.c.o [ 1%] Building C object dep/lualib/CMakeFiles/lualib.dir/lvm.c.o [ 1%] Building C object dep/bzip2/CMakeFiles/bzip2.dir/crctable.c.o [ 1%] Building C object dep/bzip2/CMakeFiles/bzip2.dir/randtable.c.o [ 1%] Building C object dep/lualib/CMakeFiles/lualib.dir/lgc.c.o [ 1%] Building C object dep/lualib/CMakeFiles/lualib.dir/lobject.c.o [ 1%] Building C object dep/lualib/CMakeFiles/lualib.dir/lauxlib.c.o [ 1%] Building C object dep/lualib/CMakeFiles/lualib.dir/ltm.c.o [ 2%] Building C object dep/lualib/CMakeFiles/lualib.dir/ldblib.c.o [ 2%] Building C object dep/lualib/CMakeFiles/lualib.dir/lfunc.c.o [ 2%] Building C object dep/lualib/CMakeFiles/lualib.dir/lundump.c.o [ 2%] Building C object dep/lualib/CMakeFiles/lualib.dir/llex.c.o [ 2%] [ 2%] Building C object dep/lualib/CMakeFiles/lualib.dir/lmem.c.o Building C object dep/lualib/CMakeFiles/lualib.dir/ltable.c.o [ 2%] Building C object dep/lualib/CMakeFiles/lualib.dir/lctype.c.o [ 2%] Building C object dep/lualib/CMakeFiles/lualib.dir/lbitlib.c.o [ 2%] Building C object dep/lualib/CMakeFiles/lualib.dir/lzio.c.o [ 2%] [ 3%] Building C object dep/lualib/CMakeFiles/lualib.dir/ltablib.c.o Building C object dep/lualib/CMakeFiles/lualib.dir/liolib.c.o [ 3%] Building C object dep/lualib/CMakeFiles/lualib.dir/linit.c.o [ 3%] Building C object dep/lualib/CMakeFiles/lualib.dir/lstate.c.o [ 3%] Building C object dep/lualib/CMakeFiles/lualib.dir/lcorolib.c.o [ 3%] Building C object dep/lualib/CMakeFiles/lualib.dir/lcode.c.o [ 3%] Building CXX object dep/acelite/ace/CMakeFiles/ace.dir/ACE.cpp.o cc1plus: error: unrecognized command line option ‘-std=c++11’ make[2]: *** [dep/acelite/ace/CMakeFiles/ace.dir/ACE.cpp.o] Error 1 make[1]: *** [dep/acelite/ace/CMakeFiles/ace.dir/all] Error 2 [ 3%] [ 3%] Building C object dep/lualib/CMakeFiles/lualib.dir/ldebug.c.o [ 3%] Building C object dep/lualib/CMakeFiles/lualib.dir/ldo.c.o Building C object dep/lualib/CMakeFiles/lualib.dir/lapi.c.o [ 3%] Building C object dep/lualib/CMakeFiles/lualib.dir/lopcodes.c.o [ 3%] Building C object dep/lualib/CMakeFiles/lualib.dir/lstrlib.c.o Linking C static library libbzip2.a [ 3%] Built target bzip2 [ 4%] Building C object dep/lualib/CMakeFiles/lualib.dir/loadlib.c.o [ 4%] Building C object dep/lualib/CMakeFiles/lualib.dir/lmathlib.c.o [ 4%] Building C object dep/lualib/CMakeFiles/lualib.dir/lparser.c.o [ 4%] Building C object dep/lualib/CMakeFiles/lualib.dir/loslib.c.o [ 4%] Building C object dep/lualib/CMakeFiles/lualib.dir/lbaselib.c.o Linking C static library liblualib.a [ 4%] Built target lualib make: *** [all] Error 2 Other kind of things I am using for the compile: -develop21 branch -lazymangos.sh installer -Ubuntu 12.04 Server x64 -Eluna + SD2 + Player Bots (option within the lazymangos installer) Is there anyone that knows how to resolve the issues?
  17. I downloaded MangosTwo_Develop21_Release_x32_August2015 then installed MySql and run the bat, but I got: 2016-03-29 14:19:15 ERROR:query ERROR: Table 'realm.db_version' doesn't exist 2016-03-29 14:19:15 ERROR:The table `db_version` in your [Realmd] database is missing or corrupt. 2016-03-29 14:19:15 ERROR: 2016-03-29 14:19:15 ERROR: [A] You have database Version: MaNGOS can not verify your database version or its existence! 2016-03-29 14:19:15 ERROR: 2016-03-29 14:19:15 ERROR: [b] You need database Version: 21 2016-03-29 14:19:15 ERROR: Structure: 1 2016-03-29 14:19:15 ERROR: Content: 0 2016-03-29 14:19:15 ERROR: Description: revision_refactor 2016-03-29 14:19:15 ERROR: 2016-03-29 14:19:15 ERROR:Please verify your database location or your database integrity. Went to github and downloaded the zip file of the database tag rev21, still the same problem, what should I do? thanks in advance PS: I downloaded and installed git for windows and the program refuses to clone from the repo with a bunch of errors too...
  18. Hi everyone, I keep getting error everytime I compile MaNGOS EVERYTIME ITS DB_VERSION so can you guys help me out with this : I've try few thing and I keep having this error :
  19. Both the realmd and mangosd start up and seem to be working fine, but doesn't seem to be talking to the db's. I get errors like this: 2016-03-21 12:59:19 SQL ERROR: Table 'characters.instance_reset' doesn't exist 2016-03-21 12:59:19 SQL: INSERT INTO instance_reset VALUES ('309','1458792000') 2016-03-21 12:59:19 SQL ERROR: Table 'characters.instance_reset' doesn't exist 2016-03-21 12:59:19 SQL: INSERT INTO instance_reset VALUES ('409','1459137600') 2016-03-21 12:59:19 SQL ERROR: Table 'characters.instance_reset' doesn't exist 2016-03-21 12:59:19 SQL: UPDATE instance_reset SET resettime = '1459137600' WHERE mapid = '409' It tells me that db's don't exist and they totally do. I can log into the client and select my realm fine. I click create character and name him. After i click create, the mangosd crashes. I'm a total newb when it comes to this stuff and I have been reading and researching for close to 24 hours now. This is driving me nuts because I feel like i am so close to getting this working. HELP!! Update Looks like server is reaching db's but still telling me character tables don't exist. Maybe MySQL is configured wrong?
  20. Hello Again, I am not having issues getting my maps working. When I run the extractors (that were built into the bin/tools) on my Linux computer (that will be the server) it fails to load 3 of the MPQ files:common.MPQ,lichking.MPQ,patch.MPQ | \/ |__ _| \| |/ __|/ _ \/ __| | |\/| / _` | .` | (_ | (_) \__ \ |_| |_\__,_|_|\_|\___|\___/|___/ DBC Extractor & Map Generator for MaNGOSTwo ________________________________________________ ________________________________________________ For help and support please visit: Website / Forum / Wiki: getMaNGOS | The home of MaNGOS - Home ________________________________________________ Detected locale: enUS Opening ./Data/enUS/locale-enUS.MPQ Opening ./Data/enUS/patch-enUS.MPQ Opening ./Data/enUS/patch-enUS-2.MPQ Opening ./Data/enUS/patch-enUS-3.MPQ Detected client build: 12340 ___________________________________ Extracting client database files... Extracted 246 files Using locale: enUS Opening ./Data/enUS/locale-enUS.MPQ Opening ./Data/enUS/patch-enUS.MPQ Opening ./Data/enUS/patch-enUS-2.MPQ Opening ./Data/enUS/patch-enUS-3.MPQ Opening ./Data/common.MPQ Error opening archive './Data/common.MPQ': Does file really exist? Opening ./Data/common-2.MPQ Opening ./Data/lichking.MPQ Error opening archive './Data/lichking.MPQ': Does file really exist? Opening ./Data/expansion.MPQ Opening ./Data/patch.MPQ Error opening archive './Data/patch.MPQ': Does file really exist? Opening ./Data/patch-2.MPQ Opening ./Data/patch-3.MPQ Extracting maps... They are all present in the 'Data' directory of the client. It then successfully extracts 3750 maps - when I run the ./mangosd it errors stating still maps missing. I do know the maps that it extracts are working and accessable as it asks for 0004331.map originally and then for 6092742.map after I then attempted to run the extractors on the client on my Windows system with the tools found in the 'downloads' section for Mangos Two Rel21 (from August 2015) and it worked successfully and it extracted 5744 maps. When I copy these maps over it rejects them as coming from an incompatible extractor version. I have already tried replacing the MPQ files that will not load in case they were some how corrupted and it made no difference. Am I missing something basic? Any help would be appreciated Thanks Zander
  21. I am at the last stage of getting a server running but I am running into this error. I obviously need to update the Database but for the life of me can not figure out how, could someone help me with this?
  22. As i will be out today another member of the team will need to take this on. This thread is for mpfans:
  23. I'm sure I haven't set something up properly, first attempt at this, so it's likely a very basic error. Can someone please help me? Thank you.
  24. I'm having a issue with Mangos One characters database I think. I followed Rel+21 guide and everything worked like a charm I executed realmd.exe and mangos.exe It loads perfectly, I start WoW, enter the realm, create a character and when I hit "create character" this error shows up: Tried everything, execute characters.sql DB again, install other version of mysql and nothing works.. Need help please.
  25. [ 47%] Building CXX object src/tools/map-extractor/CMakeFiles/map-extractor.dir/dbcfile.cpp.o In file included from /home/mangos/server/src/tools/map-extractor/dbcfile.cpp:26:0: /home/mangos/server/src/tools/map-extractor/loadlib/loadlib.h:33:45: fatal error: ..\..\dep\StormLib\src\StormLib.h: No such file or directory #include "..\..\dep\StormLib\src\StormLib.h" ^ compilation terminated. make[2]: *** [src/tools/map-extractor/CMakeFiles/map-extractor.dir/dbcfile.cpp.o] Error 1 make[1]: *** [src/tools/map-extractor/CMakeFiles/map-extractor.dir/all] Error 2 make: *** [all] Error 2 Fresh install on Ubuntu 14.04 during make using all default settings.

Contact Us

To contact us click here
You can also email us at [email protected]

Privacy Policy | Terms & Conditions

Repositories

The Link to the master list
of MaNGOS repositories:
Copyright © getMaNGOS. All rights Reserved.

This website is in no way associated with or endorsed by Blizzard Entertainment®
×
×
  • Create New...

Important Information

We have placed cookies on your device to help make this website better. You can adjust your cookie settings, otherwise we'll assume you're okay to continue. Privacy Policy Terms of Use