Jump to content

ACE 6.0.5 Problem


apolion
 Share

Recommended Posts

Hallo.

Immer wenn ich in Linux Ubuntu make oder make install eingebe kommt dieser fehler bei ACE 6.0.5!

Ich habe Linux Ubuntu 10.4 64 bit

make[3]: *** Keine Regel vorhanden, um das Target »config-win32-borland.h «,

benötigt von »all-am «, zu erstellen. Schluss.

make[3]: Verlasse Verzeichnis '/home/saro/ACE_wrappers/build/ace'

make[2]: *** [install-recursive] Fehler 1

make[2]: Verlasse Verzeichnis '/home/saro/ACE_wrappers/build/ace'

make[1]: *** [install] Fehler 2

make[1]: Verlasse Verzeichnis '/home/saro/ACE_wrappers/build/ace'

make: *** [install-recursive] Fehler 1

/home/saro/ACE_wrappers/build$

Würde mich über Hilfe oder Antwort freuen

___________________________________________________________________________________

Hello.

Whenever I come to make or make install Ubuntu Linux eingebe this error at ACE 6.0.5!

I have Linux Ubuntu 10.4 64 bit

make[3]: *** Keine Regel vorhanden, um das Target »config-win32-borland.h «,

benötigt von »all-am «, zu erstellen. Schluss.

make[3]: Verlasse Verzeichnis '/home/saro/ACE_wrappers/build/ace'

make[2]: *** [install-recursive] Fehler 1

make[2]: Verlasse Verzeichnis '/home/saro/ACE_wrappers/build/ace'

make[1]: *** [install] Fehler 2

make[1]: Verlasse Verzeichnis '/home/saro/ACE_wrappers/build/ace'

make: *** [install-recursive] Fehler 1

/home/saro/ACE_wrappers/build$

Would appreciate help or answer

/edit I taken ACE+TAO+CIAO 6.0.3

Link to comment
Share on other sites

 Share

×
×
  • Create New...

Important Information

We have placed cookies on your device to help make this website better. You can adjust your cookie settings, otherwise we'll assume you're okay to continue. Privacy Policy Terms of Use