Jump to content

[Three] Scriptdev2 Build FAILED


myraje

Recommended Posts

help ! when i buld scriptdev2 ,the error occur !

Link:

Creating library ..\\..\\..\\..\\bin\\win32_release\\mangosscript.lib and object ..\\..\\..\\..\\bin\\win32_release\\mangosscript.exp

precompiled.obj : error LNK2019: unresolved external symbol "public: __thiscall ByteBuffer::ByteBuffer(unsigned int,bool)" ([email protected]@[email protected][email protected]) referenced in function "public: __thiscall PackedGuid::PackedGuid(class ObjectGuid const &)" ([email protected]@[email protected]@@@Z)

..\\..\\..\\..\\bin\\win32_release\\mangosscript.dll : fatal error LNK1120: 1 unresolved externals

Build FAILED.

Link to comment
Share on other sites

Archived

This topic is now archived and is closed to further replies.

×
×
  • Create New...

Important Information

We have placed cookies on your device to help make this website better. You can adjust your cookie settings, otherwise we'll assume you're okay to continue. Privacy Policy Terms of Use