Jump to content

drarkanex

Members
  • Content Count

    26
  • Donations

    0.00 GBP 
  • Joined

  • Last visited

  • Days Won

    1

Everything posted by drarkanex

  1. Still broken, as of last World DB update: Rel21_10_002_Add_Field_Comments_pt2.sql Log says: WORLD: Received opcode SMSG_UI_TIME WORLD: got cast spell packet, spellId - 6247, cast_count: 57, unk_flags 0, data length = 19 Sending SMSG_SPELL_START id=6247 Sending SMSG_SPELL_GO id=6247 Spell 6247 Effect0 : 33 Targets: -, -, Gameobject (Entry: 202168 Guid: 83004) Sending SMSG_SPELL_START id=71291 WORLD: Received opcode CMSG_GAMEOBJ_REPORT_USE guid: Gameobject (Entry: 202168 Guid: 83004) Sending SMSG_SPELL_GO id=71291 Spell 71291 Effect0 : 140 Targets: Player Mortalitas (Guid: 2), -, - Spell 71281 Effect0 : 3 Targets: Creature (Entry: 36765 Guid: 133182), -, - Spell ScriptStart spellid 71281 in EffectDummy WORLD: Received opcode CMSG_TIME_SYNC_RESP: counter 68, client ticks 27283906, time since last sync 10042 WORLD: Opcode CMSG_TIME_SYNC_RESP -- Our ticks: 27283956, diff 50, latency 0
    Flawless install. Thank you for the precompiled binaries. Not having a solid internet connection, this keeps me sane.
  2. Was on Wheezy, then dist updraded to Jessie because of C++11 errors in wheezy in this same file and the same point. [ 34%] Building CXX object src/modules/Eluna/CMakeFiles/LuaEngine.dir/ServerHook s.cpp.o In file included from /home/mangos/mangos-three/server/src/modules/Eluna/ElunaIncludes.h:28:0, from /home/mangos/mangos-three/server/src/modules/Eluna/ServerHooks.cpp:15: /home/mangos/mangos-three/server/src/game/Object/ObjectMgr.h:140:15: error: expected constructor, destructor, or type conversion before ‘(’ token static_assert (MAX_DB_SCRIPT_STRING_ID < ACE_INT32_MAX, "Must scope with int32 range"); ^ src/modules/Eluna/CMakeFiles/LuaEngine.dir/build.make:77: recipe for target 'src/modules/Eluna/CMakeFiles/LuaEngine.dir/ServerHooks.cpp.o' failed make[2]: *** [src/modules/Eluna/CMakeFiles/LuaEngine.dir/ServerHooks.cpp.o] Error 1 CMakeFiles/Makefile2:1163: recipe for target 'src/modules/Eluna/CMakeFiles/LuaEngine.dir/all' failed make[1]: *** [src/modules/Eluna/CMakeFiles/LuaEngine.dir/all] Error 2 Makefile:117: recipe for target 'all' failed make: *** [all] Error 2 I'm going to disable Eluna and see if it continues on [EDIT] Disabled Eluna, error still occurred. So Enabled Eluna and disabled SD3 and so far so good. Looks like SD3 is broke, at least for me and my setup. If anyone has any insight on this, let me know, I could be forgetting something. SD3 compiles fine with Mangos Two. [EDIT 2} Spoke too soon, same error, different area.. [ 63%] Building CXX object src/modules/Eluna/CMakeFiles/LuaEngine.dir/ServerHooks.cpp.o In file included from /home/mangos/mangos-three/server/src/modules/Eluna/ElunaIncludes.h:28:0, from /home/mangos/mangos-three/server/src/modules/Eluna/ServerHooks.cpp:15: /home/mangos/mangos-three/server/src/game/Object/ObjectMgr.h:140:15: error: expected constructor, destructor, or type conversion before ‘(’ token static_assert (MAX_DB_SCRIPT_STRING_ID < ACE_INT32_MAX, "Must scope with int32 range"); ^ src/modules/Eluna/CMakeFiles/LuaEngine.dir/build.make:77: recipe for target 'src/modules/Eluna/CMakeFiles/LuaEngine.dir/ServerHooks.cpp.o' failed make[2]: *** [src/modules/Eluna/CMakeFiles/LuaEngine.dir/ServerHooks.cpp.o] Error 1 CMakeFiles/Makefile2:1039: recipe for target 'src/modules/Eluna/CMakeFiles/LuaEngine.dir/all' failed make[1]: *** [src/modules/Eluna/CMakeFiles/LuaEngine.dir/all] Error 2 Makefile:117: recipe for target 'all' failed make: *** [all] Error 2
  3. stdlib.h needs to be added to src/tools/genrevision/genrevision.cpp Compiling from fresh source gives an error "‘atoi’ was not declared in this scope" Adding #include to src/tools/genrevision/genrevision.cpp underneath #include resolves this issue
  4. MangosTwo Install - Debian - Together Doing some tweaking to it now
  5. OK. Looked thru github and was missing some critical .SQL files. Applied them and seems all better now.
  6. Well.. I was looking at the aiplayerbot.conf and it appears you have to put a tilde before the command.. Lol OK.. All better now. Again thanks..
  7. OK. Thanks. I rebuilt mangos and still the same issue. I mean bots are there. They just stand there.. Buff themselves.. Make emotes.. Etc. And will only move if I'm attacking something. Is anyone else's playerbots working? Is there anything special you have to do or is it pretty much cut and dry. I've reinstalled 4 times so far with the same results..
  8. I've been busy today trying to figure these errors out and they pop up quite frequently, just trying to nail down my previous issue of the Bots not responding. MangosZero_PlayerBot_Develop21_Release_x32_August2015.zip is the build I downloaded. Sure I could probably build and i'm considering it at this point, but I just want to figure some of these errors out with the DB. I've looked thru all the SQL to try to find these missing tables but I can't find them, but if I look in the Mangos3 database I find them. I'm not sure if i'm updating the DBs correctly, but I've reinstalled about 3 times all with the same results so I must be missing something. Anyways, I have 3 databases. m0b_char, m0b_realmd and m0b_world (characters, realmd and mangos respectively) The one i'm getting more errors on is the world DB, here's a snippet: 2015-09-07 13:09:56 ERROR:SQL: select max(ChanceOrQuestChance) from ( select ChanceOrQuestChance from gameobject_loot_template where item = '929' union select ChanceOrQuestChance from spell_loot_template where item = '929' union select ChanceOrQuestChance from disenchant_loot_template where item = '929' union select ChanceOrQuestChance from fishing_loot_template where item = '929' union select ChanceOrQuestChance from item_loot_template where item = '929' union select ChanceOrQuestChance from milling_loot_template where item = '929' union select ChanceOrQuestChance from pickpocketing_loot_template where item = '929' union select ChanceOrQuestChance from prospecting_loot_template where item = '929' union select ChanceOrQuestChance from reference_loot_template where item = '929' union select ChanceOrQuestChance from skinning_loot_template where item = '929' union select ChanceOrQuestChance from creature_loot_template where item = '929' union select 0 ) a 2015-09-07 13:09:56 ERROR:query ERROR: Table 'm0b_world.milling_loot_template' doesn't exist 2015-09-07 13:09:56 ERROR:SQL: select max(ChanceOrQuestChance) from ( select ChanceOrQuestChance from gameobject_loot_template where item = '929' union select ChanceOrQuestChance from spell_loot_template where item = '929' union select ChanceOrQuestChance from disenchant_loot_template where item = '929' union select ChanceOrQuestChance from fishing_loot_template where item = '929' union select ChanceOrQuestChance from item_loot_template where item = '929' union select ChanceOrQuestChance from milling_loot_template where item = '929' union select ChanceOrQuestChance from pickpocketing_loot_template where item = '929' union select ChanceOrQuestChance from prospecting_loot_template where item = '929' union select ChanceOrQuestChance from reference_loot_template where item = '929' union select ChanceOrQuestChance from skinning_loot_template where item = '929' union select ChanceOrQuestChance from creature_loot_template where item = '929' union select 0 ) a 2015-09-07 13:09:56 ERROR:query ERROR: Table 'm0b_world.milling_loot_template' doesn't exist 2015-09-07 13:09:56 ERROR:SQL: select max(ChanceOrQuestChance) from ( select ChanceOrQuestChance from gameobject_loot_template where item = '929' union select ChanceOrQuestChance from spell_loot_template where item = '929' union select ChanceOrQuestChance from disenchant_loot_template where item = '929' union select ChanceOrQuestChance from fishing_loot_template where item = '929' union select ChanceOrQuestChance from item_loot_template where item = '929' union select ChanceOrQuestChance from milling_loot_template where item = '929' union select ChanceOrQuestChance from pickpocketing_loot_template where item = '929' union select ChanceOrQuestChance from prospecting_loot_template where item = '929' union select ChanceOrQuestChance from reference_loot_template where item = '929' union select ChanceOrQuestChance from skinning_loot_template where item = '929' union select ChanceOrQuestChance from creature_loot_template where item = '929' union select 0 ) a 2015-09-07 13:09:56 ERROR:query ERROR: Table 'm0b_world.milling_loot_template' doesn't exist m0b_world.milling_loot_template table doesn't exist. My big question of the day is when initially installing the databases, the only way I can get realmd.exe and mangosd.exe to run is if I apply Rel21 world, char and realmd updates in the Database/characters, Database/Realm and Database/World Updates/Rel21 folder. The only sql i'm injecting into the appropriate database is the db_version. Nothing else. However when I look at the other SQL in the other updates or try to inject them into their database, I get errors and nothing happens, but the server will run just fine. I may be having an issue where i'm not doing this correctly and i'm kind of curious as to if this is Devel21, why are the other Rel18,19,20 updates there and what am I supposed to do with them?
  9. Thanks madmax, but the bots are not responding to any of those commands. Not even the help command. I've deleted the wdb cache just in case and deleted the wtf folder to see if that was causing it.
  10. [MangosZero] Can't communicate with the bots. I can invite them to my group, but they just stand there and don't follow. they don't respond to Tells or Party messages. They Message me all the time wanting me to do stuff but when I invite, nothing happens. However if I engage in combat, they engage as well. Is there something i'm overlooking?
  11. I'm soooo sorry Max.. totally my fault.. in another config I was hard linking the data dir "C:/mangos21/data", changed it to ../data and worked like a charm... Thank you for replying.. It was just hot here and I wasn't thinking clearly...
  12. 2015-09-05 13:11:19 21000 [world-daemon] 2015-09-05 13:11:19 <Ctrl-C> to stop. __ __ _ _ ___ ___ ___ | \/ |__ _| \| |/ __|/ _ \/ __| We Love | |\/| / _` | .` | (_ | (_) \__ \ Vanilla Wow |_| |_\__,_|_|\_|\___|\___/|___/ ____ For help and support please visit: /_ /___ _ _ ___ Website: https://getmangos.eu / // -_) '_/ _ \ Wiki: http://github.com/mangoswiki /___\___|_| \___/ 2015-09-05 13:11:19 Using configuration file mangosd.conf. 2015-09-05 13:11:19 World Database total connections: 2 2015-09-05 13:11:19 MySQL client library: 5.6.26 2015-09-05 13:11:19 MySQL server ver: 5.5.39 2015-09-05 13:11:19 MySQL client library: 5.6.26 2015-09-05 13:11:19 MySQL server ver: 5.5.39 2015-09-05 13:11:19 Character Database total connections: 2 2015-09-05 13:11:19 MySQL client library: 5.6.26 2015-09-05 13:11:19 MySQL server ver: 5.5.39 2015-09-05 13:11:19 MySQL client library: 5.6.26 2015-09-05 13:11:19 MySQL server ver: 5.5.39 2015-09-05 13:11:19 Login Database total connections: 2 2015-09-05 13:11:19 MySQL client library: 5.6.26 2015-09-05 13:11:19 MySQL server ver: 5.5.39 2015-09-05 13:11:19 MySQL client library: 5.6.26 2015-09-05 13:11:19 MySQL server ver: 5.5.39 2015-09-05 13:11:19 2015-09-05 13:11:19 Realm running as realm ID 1 2015-09-05 13:11:19 2015-09-05 13:11:19 Using World DB: Version: 21, Structure: 1, Content: 0 2015-09-05 13:11:19 2015-09-05 13:11:19 Using DataDir ./ 2015-09-05 13:11:19 WORLD: VMap support included. LineOfSight:1, getHeight:1, indoorCheck:1 2015-09-05 13:11:19 WORLD: VMap data directory is: ./vmaps 2015-09-05 13:11:19 WORLD: MMap pathfinding enabled 2015-09-05 13:11:19 2015-09-05 13:11:19 ERROR:Please check for the existence of map file './maps/0004331.map' 2015-09-05 13:11:19 ERROR:Correct *.map files not found in path './maps' or *.vmtree/*.vmtile files in './vmaps'. Please place *.map and vmap files in appropriate directories or correct the DataDir value in the mangosd.conf file. //On Windows7// Moving from Branch20 to Devel21, all seems fine, i'm able to bring up realmd.exe but when i bring up mangosd.exe i get the above error. When running Branch20, no errors and play as usual. Running MadMax's AIBot and non AIBot version produces the same error. //On Debian Linux// Same error, can't find 0004331.map. ----------- On both, 0004331.map is present in the maps folder, but looking at vmaps, there is nothing to indicate 0004331 or 00_04_331 or anything of the like. Am I overlooking something, i've always been pretty savvy with mangos but this is boggling my mind..
  13. Ok, ran thru some tests, make sure you do a git pull in your server source and run thru my wiki MangosZero Install - Debian - Together
  14. I had good luck running the server/linux/getmangos.sh script The extractors were built and installed properly, but i'm still working on it with not running the script
  15. setting option -DBUILD_TOOLS=1 produces errors during cmake/make in Debian 7.2 x64 [SOLVED] adding Build External Ace stopped this error Not able to compile the map extractors in Debian. My Build options are: cmake -DCMAKE_INSTALL_PREFIX=/opt/mZero2 -DDEBUG=1 -DBUILD_TOOLS=1 .. After running make, this error is produced [ 97%] Building CXX object src/tools/Movemap-Generator/CMakeFiles/movemap-generator.dir/VMapExtensions.cpp.o In file included from /home/mangos/mangos-source/server/src/tools/Movemap-Generator/VMapExtensions.cpp:30:0: /home/mangos/mangos-source/server/src/game/vmap/ModelInstance.h:167:45: warning: type qualifiers ignored on function return type [-Wignored-qualifiers] /home/mangos/mangos-source/server/src/tools/Movemap-Generator/VMapExtensions.cpp:67:52: warning: type qualifiers ignored on function return type [-Wignored-qualifiers] Linking CXX executable movemap-generator CMakeFiles/movemap-generator.dir/IntermediateValues.cpp.o:(.rodata+0x258): undefined reference to `pthread_cancel' CMakeFiles/movemap-generator.dir/generator.cpp.o:(.rodata+0x9d0): undefined reference to `pthread_cancel' CMakeFiles/movemap-generator.dir/MapBuilder.cpp.o:(.rodata+0x748): undefined reference to `pthread_cancel' CMakeFiles/movemap-generator.dir/TerrainBuilder.cpp.o:(.rodata+0x2f8): undefined reference to `pthread_cancel' ../../../dep/src/g3dlite/libg3dlite.a(Matrix3.cpp.o):(.rodata+0xd8): undefined reference to `pthread_cancel' ../../../dep/src/g3dlite/libg3dlite.a(System.cpp.o):(.rodata+0x4a8): more undefined references to `pthread_cancel' follow ../../../dep/acelite/ace/libace.so: undefined reference to `aio_return' ../../../dep/acelite/ace/libace.so: undefined reference to `aio_read' ../../../dep/acelite/ace/libace.so: undefined reference to `pthread_rwlock_unlock' ../../../dep/acelite/ace/libace.so: undefined reference to `aio_cancel' ../../../dep/acelite/ace/libace.so: undefined reference to `pthread_mutexattr_destroy' ../../../dep/acelite/ace/libace.so: undefined reference to `sem_unlink' ../../../dep/acelite/ace/libace.so: undefined reference to `pthread_create' ../../../dep/acelite/ace/libace.so: undefined reference to `sem_open' ../../../dep/acelite/ace/libace.so: undefined reference to `pthread_rwlockattr_init' ../../../dep/acelite/ace/libace.so: undefined reference to `pthread_key_create' ../../../dep/acelite/ace/libace.so: undefined reference to `pthread_rwlock_init' ../../../dep/acelite/ace/libace.so: undefined reference to `sem_wait' ../../../dep/acelite/ace/libace.so: undefined reference to `sem_init' ../../../dep/acelite/ace/libace.so: undefined reference to `pthread_rwlockattr_setpshared' ../../../dep/acelite/ace/libace.so: undefined reference to `pthread_getspecific' ../../../dep/acelite/ace/libace.so: undefined reference to `sem_destroy' ../../../dep/acelite/ace/libace.so: undefined reference to `dlopen' ../../../dep/acelite/ace/libace.so: undefined reference to `pthread_mutex_trylock' ../../../dep/acelite/ace/libace.so: undefined reference to `pthread_key_delete' ../../../dep/acelite/ace/libace.so: undefined reference to `pthread_rwlock_rdlock' ../../../dep/acelite/ace/libace.so: undefined reference to `pthread_attr_setstack' ../../../dep/acelite/ace/libace.so: undefined reference to `pthread_condattr_setpshared' ../../../dep/acelite/ace/libace.so: undefined reference to `pthread_attr_setstacksize' ../../../dep/acelite/ace/libace.so: undefined reference to `pthread_rwlockattr_destroy' ../../../dep/acelite/ace/libace.so: undefined reference to `pthread_kill' ../../../dep/acelite/ace/libace.so: undefined reference to `pthread_rwlock_trywrlock' ../../../dep/acelite/ace/libace.so: undefined reference to `sem_close' ../../../dep/acelite/ace/libace.so: undefined reference to `sem_post' ../../../dep/acelite/ace/libace.so: undefined reference to `pthread_rwlock_destroy' ../../../dep/acelite/ace/libace.so: undefined reference to `pthread_rwlock_wrlock' ../../../dep/acelite/ace/libace.so: undefined reference to `pthread_mutexattr_setpshared' ../../../dep/acelite/ace/libace.so: undefined reference to `sem_trywait' ../../../dep/acelite/ace/libace.so: undefined reference to `dlclose' ../../../dep/acelite/ace/libace.so: undefined reference to `clock_gettime' ../../../dep/acelite/ace/libace.so: undefined reference to `dlerror' ../../../dep/acelite/ace/libace.so: undefined reference to `dlsym' ../../../dep/acelite/ace/libace.so: undefined reference to `sem_timedwait' ../../../dep/acelite/ace/libace.so: undefined reference to `pthread_sigmask' ../../../dep/acelite/ace/libace.so: undefined reference to `pthread_rwlock_tryrdlock' ../../../dep/acelite/ace/libace.so: undefined reference to `aio_error' ../../../dep/acelite/ace/libace.so: undefined reference to `pthread_mutexattr_settype' ../../../dep/acelite/ace/libace.so: undefined reference to `pthread_join' ../../../dep/acelite/ace/libace.so: undefined reference to `aio_write' ../../../dep/acelite/ace/libace.so: undefined reference to `aio_suspend' ../../../dep/acelite/ace/libace.so: undefined reference to `pthread_setspecific' ../../../dep/acelite/ace/libace.so: undefined reference to `pthread_mutex_timedlock' ../../../dep/acelite/ace/libace.so: undefined reference to `pthread_mutexattr_init' collect2: error: ld returned 1 exit status make[2]: *** [src/tools/Movemap-Generator/movemap-generator] Error 1 make[1]: *** [src/tools/Movemap-Generator/CMakeFiles/movemap-generator.dir/all] Error 2 make: *** [all] Error 2
  16. I take this back i'm still working on it. I'm having build errors with the extractors. get back with ya
  17. Needs to be added to the wiki I was bored with my limited internet connection in the sticks so I figured i'd make a howto hoping it would help someone out. Feel free to copy it but give me credit if you do [url=http://together.chrisfaulkner.org/index.php/MangosZero_Install_-_Debian]MangosZero Install - Debian - Together[/url] Also at the bottom I have my email address if you are having any issues with this HowTo i'll address them.
  18. I was bored with my limited internet connection in the sticks so I figured i'd make a howto hoping it would help someone out. Feel free to copy it but give me credit if you do MangosZero Install - Debian - Together Also at the bottom I have my email address if you are having any issues with this HowTo i'll address them.

Contact Us

To contact us click here
You can also email us at [email protected]

Privacy Policy | Terms & Conditions

Repositories

The Link to the master list
of MaNGOS repositories:
Copyright © getMaNGOS. All rights Reserved.

This website is in no way associated with or endorsed by Blizzard Entertainment®
×
×
  • Create New...